{"text_format":"1","workbook":"xlsx","n_sheets":3,"sheets":["Ordering","Prices for premixed solutions","Lister"],"not_rendered":{"charts":0,"images":0,"macros":1,"external_links":0,"defined_names":2,"comments":0,"pivot_tables":0},"unopened":[],"bounds":{"document_bytes":16777216,"sheet_cells":100000,"rows_first":2000,"rows_last":500,"rows_between":2000,"halvings":0,"cell_chars":16384,"cell_head_chars":4096},"cells_cut":0,"cells_raw":0,"read":"whole","date_system":"1900"}

{"sheet":"Ordering","index":0,"n_rows":53,"n_cols":20,"rows_kept":53,"cut":false,"hidden":false,"merged":[[38,2,38,10],[39,1,40,10],[24,1,24,4],[27,1,27,4],[28,1,28,4],[29,1,29,4],[28,7,28,8],[28,9,28,10],[29,7,29,8],[29,9,29,10],[28,5,28,6],[29,5,29,6],[30,1,30,4],[30,5,30,6],[31,1,31,4],[31,5,31,6],[16,1,16,2],[17,1,17,2],[16,3,16,6],[17,3,17,6],[26,1,26,4],[25,1,25,4],[24,5,24,6],[22,6,22,10],[23,6,23,10],[24,7,24,8],[24,9,24,10],[25,7,25,8],[4,8,5,10],[6,8,6,9],[27,5,27,6],[26,5,26,6],[25,5,25,6],[16,7,16,10],[17,7,17,10],[27,7,27,8],[27,9,27,10],[25,9,25,10],[26,7,26,8],[26,9,26,10],[11,8,11,9],[9,8,9,10],[10,8,10,9],[30,7,30,8],[30,9,30,10],[31,7,31,8],[31,9,31,10],[32,7,32,8],[32,9,32,10],[35,7,35,8],[35,9,35,10],[33,7,33,8],[35,1,35,4],[34,1,34,4],[33,5,33,6],[35,5,35,6],[34,5,34,6],[33,1,33,4],[33,9,33,10],[41,8,41,10],[18,1,18,5],[18,6,18,10],[19,1,19,5],[19,6,19,10],[20,6,20,10],[21,6,21,10],[20,1,20,5],[21,1,21,5],[22,1,22,5],[23,1,23,5],[41,2,41,4],[32,1,32,4],[32,5,32,6],[34,7,34,8],[34,9,34,10]]}
[]
[null,null,null,null,null,null,null,null,null,null,null,null,null,null,null,null,null,null,null,"Data"]
[]
[]
[null,null,null,null,null,null,null,null,"Medicine requisition"]
[]
[null,null,null,null,null,null,null,null,"(M3xxx)"]
[]
[]
[null,null,null,null,null,null,null,null,"Confined for ACF"]
[null,null,null,null,null,null,null,null,"Served by:"]
[null,null,null,null,null,null,null,null,"Date:"]
[]
[]
[]
[]
[null,"ACF account no.:",null,"Account holder’s name: ",null,null,null,"Project no. (P number):"]
[]
[null,"Department:",null,null,null,null,"Requester’s name:"]
[]
[null,"Required pick-up date:                                                             ",null,null,null,null,"Order date:"]
[]
[null,"Can be collected on:                                                             ",null,null,null,null,"Location:"]
[null,null,null,null,null,null,"Panum 01"]
[null,"Premixed Medicine ",null,null,null,"Price per vial",null,"Total amount of vials",null,"Storage"]
[null,null,null,null,null,{"$f":"_xlfn.XLOOKUP(B26,'Prices for premixed solutions'!A2:A24,'Prices for premixed solutions'!B2:B24,\" \",0,1)","v":" "},null,null,null,{"$f":"_xlfn.XLOOKUP(B26,Lister!A13:A35,Lister!J13:J35,\" \",0,1)","v":" "}]
[null,null,null,null,null,{"$f":"_xlfn.XLOOKUP(B27,'Prices for premixed solutions'!A2:A24,'Prices for premixed solutions'!B2:B24,\" \",0,1)","v":" "},null,null,null,{"$f":"_xlfn.XLOOKUP(B27,Lister!A13:A35,Lister!J13:J35,\" \",0,1)","v":" "}]
[null,null,null,null,null,{"$f":"_xlfn.XLOOKUP(B28,'Prices for premixed solutions'!A2:A24,'Prices for premixed solutions'!B2:B24,\" \",0,1)","v":" "},null,null,null,{"$f":"_xlfn.XLOOKUP(B28,Lister!A13:A35,Lister!J13:J35,\" \",0,1)","v":" "}]
[null,"Predefined Prescription  Medicine ",null,null,null,"Prescription fee",null,"Total amount",null,"Distribution type"]
[null,null,null,null,null,{"$f":"_xlfn.XLOOKUP(B30,Lister!A3:A8,Lister!H3:H8,\" \",0,1)","v":" "}]
[null,null,null,null,null,{"$f":"_xlfn.XLOOKUP(B31,Lister!A3:A8,Lister!H3:H8,\" \",0,1)","v":" "}]
[null,null,null,null,null,{"$f":"_xlfn.XLOOKUP(B32,Lister!A3:A8,Lister!H3:H8,\" \",0,1)","v":" "}]
[null,"Prescription Medicine ",null,null,null,"Prescription fee",null,"Total amount",null,"Distribution type"]
[]
[]
[]
[]
[]
[null,"Comments"]
[]
[]
[]
[]
[]
[]
[]
[]
[]
[]
[]
[]
[]
[null,null,null,null,null,null,null,null,null,"vers:","5.2"]

{"sheet":"Prices for premixed solutions","index":1,"n_rows":24,"n_cols":3,"rows_kept":24,"cut":false,"hidden":false,"merged":[]}
["Medicinrekvisition prisliste","Price"]
["Atipamezole antidote(diluted for mice ), 0,1 mg/ml, 1x10ml)",70.390320000000017]
["Atipamezole antidote(diluted for rats ), 1 mg/ml, 1x10ml)",117.75390000000002]
["Buprenorphine (diluted) 0,03mg/ml, 1x10 ml",78.260160000000013]
["Buprenorphine 0,2mg, 1x sublingual tablet",3.9864000000000002]
["Buprenorphine 0,4mg, 1x sublingual tablet",3.8772800000000007]
["Butorphanol(diluted), 1 mg/ml, 1x10 ml",84.506399999999999]
["Carprofen (diltued for rats) 5mg/ml, 1x10 ml",67.99496000000002]
["Carprofen (diluted for mice) 0,5mg/ml, 1x10 ml",65.41442600000002]
["Ethiqa XR(buprenorfin extended-release),1,3 mg/ml, 1x3 ml",6116.3799999999992,"* indicative price, my chance between imports"]
["Hypnorm (diluted), 1x4 ml ",759.00000000000011]
["Hypnorm (diluted), 1x4 ml + 2x1 ml Midazolam",779.68880000000001]
["Isofluran, 1x250 ml",457.68800000000005]
["Ketamine and Xylazine (diluted for mice), 1x5 ml",53.275145000000002]
["Ketamine and Xylazine (diluted for rat), 1x10 ml",96.983480000000014]
["Ketamine, Xylazine, Midazolam (diluted for mice), 1x4,65 ml",53.97178000000001]
["Ketamine, Xylazine, Midazolam (diluted for rat), 1x9 ml",83.735825000000006]
["Lidocaine and Bupivacaine (diluted for mice), 2,5mg/ml + 1,25mg/ml, 1x8 ml",76.546800000000019]
["Lidocaine and Bupivacaine (diluted for rats), 5mg/ml + 2,5mg/ml, 1x10 ml",60.693600000000004]
["Meloxcicam(diluted for mice), 1x10 ml",103.49790000000002]
["Mice Zoletil + Butorphanol, 1x10 ml",185.7878]
["Mice Zoletil + NaCl, 1x10 ml",127.98809047619051]
["Pentobarbital 50 mg/ml, 1x50 ml",173.89680000000004]
["Pentobarbital w/ Lidocaine 200+20 mg/ml, 1x100 ml",331.68960000000004]

{"sheet":"Lister","index":2,"n_rows":35,"n_cols":10,"rows_kept":35,"cut":false,"hidden":true,"merged":[]}
["Lister"]
["recepter",null,null,null,null,null,null,"Price"]
["Carprofen  50mg/ml, 1x50ml - prescription",null,null,null,null,null,null,0]
["Isoflurane (Attane vet.) 1x250ml - prescription",null,null,null,null,null,null,0]
["Ketamin (Ketaminol vet.) 100mg/ml, 1x20ml - prescription",null,null,null,null,null,null,0]
["METACAM® til hund, kat og marsvin, 2 mg/ml, 1x10 ml - prescription",null,null,null,null,null,null,0]
["NaCl (B. Braun), 9mg/ml, 20x50 ml - prescription ",null,null,null,null,null,null,0]
["Xylazin(Xysol vet.), 20mg/ml, 1x25 - prescription",null,null,null,null,null,null,0]
[]
["Ketamin (Ketaminol vet.) 50mg/ml, 1x20ml - prescription",null,null,null,null,null,null,0]
[]
["udleveringer",null,null,null,null,null,null,null,null,"Storage"]
["Atipamezole antidote(diluted for mice ), 0,1 mg/ml, 1x10ml)",null,null,null,null,null,null,null,null,"Room temperature. Light sensitive."]
["Atipamezole antidote(diluted for rats ), 1 mg/ml, 1x10ml)",null,null,null,null,null,null,null,null,"Room temperature. Light sensitive."]
["Buprenorphine (diluted) 0,03mg/ml, 1x10 ml",null,null,null,null,null,null,null,null,"Room temperature. Light sensitive."]
["Buprenorphine 0,2mg, 1x sublingual tablet",null,null,null,null,null,null,null,null,"Room temperature. "]
["Buprenorphine 0,4mg, 1x sublingual tablet",null,null,null,null,null,null,null,null,"Room temperature."]
["Butorphanol(diluted), 1 mg/ml, 1x10 ml",null,null,null,null,null,null,null,null,"Room temperature."]
["Carprofen (diltued for rats) 5mg/ml, 1x10 ml",null,null,null,null,null,null,null,null,"Room temperature. Light sensitive."]
["Carprofen (diluted for mice) 0,5mg/ml, 1x10 ml",null,null,null,null,null,null,null,null,"Room temperature. Light sensitive."]
["Ethiqa XR(buprenorfin extended-release),1,3 mg/ml, 1x3 ml",null,null,null,null,null,null,null,null,"Room temperature. Light sensitive."]
["Hypnorm (diluted), 1x4 ml ",null,null,null,null,null,null,null,null,"Room temperature."]
["Hypnorm (diluted), 1x4 ml + 2x1 ml Midazolam",null,null,null,null,null,null,null,null,"Room temperature. "]
["Isofluran, 1x250 ml",null,null,null,null,null,null,null,null,"Room temperature. "]
["Ketamine and Xylazine (diluted for mice), 1x5 ml",null,null,null,null,null,null,null,null,"Refrigerated. "]
["Ketamine and Xylazine (diluted for rat), 1x10 ml",null,null,null,null,null,null,null,null,"Refrigerated. "]
["Ketamine, Xylazine, Midazolam (diluted for mice), 1x4,65 ml",null,null,null,null,null,null,null,null,"Refrigerated. "]
["Ketamine, Xylazine, Midazolam (diluted for rat), 1x9 ml",null,null,null,null,null,null,null,null,"Refrigerated. "]
["Lidocaine and Bupivacaine (diluted for mice), 2,5mg/ml + 1,25mg/ml, 1x8 ml",null,null,null,null,null,null,null,null,"Refrigerated. "]
["Lidocaine and Bupivacaine (diluted for rats), 5mg/ml + 2,5mg/ml, 1x10 ml",null,null,null,null,null,null,null,null,"Refrigerated. "]
["Meloxcicam(diluted for mice), 1x10 ml",null,null,null,null,null,null,null,null,"Room temperature."]
["Mice Zoletil + Butorphanol, 1x10 ml",null,null,null,null,null,null,null,null,"Refrigerated. "]
["Mice Zoletil + NaCl, 1x10 ml",null,null,null,null,null,null,null,null,"Refrigerated. "]
["Pentobarbital 50 mg/ml, 1x50 ml",null,null,null,null,null,null,null,null,"Room temperature. "]
["Pentobarbital w/ Lidocaine 200+20 mg/ml, 1x100 ml",null,null,null,null,null,null,null,null,"Room temperature. "]